Discuss Scratch
- mii-10
-
Scratcher
100+ posts
Scratch2.0をModする会
既存のブロックのそれが見当たらないんです。確かsrcだったと思います。省略すみません。Interpreter.asとspecs.asはどこのフォルダーにあるのですか?
when this sprite clicked
などで検索してみては?
- apple502j
-
Scratcher
1000+ posts
Scratch2.0をModする会
scratch-flashをgitで落としたなら、そのフォルダの真下にsrcがあり、
そこにSpecs.as
そのフォルダのinterpreterフォルダ内に
Interpreter.asがあります
そこにSpecs.as
そのフォルダのinterpreterフォルダ内に
Interpreter.asがあります
- apple502j
-
Scratcher
1000+ posts
Scratch2.0をModする会
scratch-flashはもうありますか?scratch-flashをgitで落としたなら、そのフォルダの真下にsrcがあり、どのようなGitコマンドを実行すれば良いですか?
そこにSpecs.as
そのフォルダのinterpreterフォルダ内に
Interpreter.asがあります
そのフォルダ内にはCOPYINGとかsrcとかTRADEMARKとかREADME.mdとかがあるはずです
- mii-10
-
Scratcher
100+ posts
Scratch2.0をModする会
scratchをGradleでコンパイルしようとしたんですが、以下のエラーが出ました。javaのバージョン10.0.1が、コンパイラで認識できないことがが原因ですのでjavaのバージョンを下げてみてください。この対処方法はありますか?FAILURE: Build failed with an exception.
* What went wrong:
Could not determine java version from '10.0.1'.
* Try:
Run with --stacktrace option to get the stack trace. Run with --info or --debug option to get more log output.
自分は1.8.0_171です。
- inoking
-
Scratcher
1000+ posts
Scratch2.0をModする会
scratchをGradleでコンパイルしようとしたんですが、以下のエラーが出ました。#186 で同様の質問と、それを解消するためのアプローチが出ていますが試しましたか?この対処方法はありますか?FAILURE: Build failed with an exception.
* What went wrong:
Could not determine java version from '10.0.1'.
* Try:
Run with --stacktrace option to get the stack trace. Run with --info or --debug option to get more log output.
- apple502j
-
Scratcher
1000+ posts
Scratch2.0をModする会
Java SE 8を入れることでなんとかコンパイラ認識できるところまできたんですが今度はこんなエラーが出ましたスペルミスです。この対処方法はあるでしょうかFAILURE: Build failed with an exception.
* What went wrong:
Task 'bulid' not found in root project 'scratch-flash'. Some candidates are: 'build'.
* Try:
Run gradlew tasks to get a list of available tasks. Run with --stacktrace option to get the stack trace. Run with --info or --debug option to get more log output.
BUILD FAILED
buildです。(ビー・ユー・アイ・エル・ディー、小文字にしてね。)
- itnkmkw
-
Scratcher
1000+ posts
Scratch2.0をModする会
mod始めようと思いまして、試してみたんですが、最初のビルド中に、「./gradlew build」を入れたらって出ました。どうすればいいですか?Windows10で、javaは最新版です。
Could not determine java version from '10.0.1'
- jun50
-
Scratcher
1000+ posts
Scratch2.0をModする会
mod始めようと思いまして、試してみたんですが、最初のビルド中に、「./gradlew build」を入れたらjavaは最新版じゃない方がいいです。って出ました。どうすればいいですか?Windows10で、javaは最新版です。Could not determine java version from '10.0.1'
機械翻訳でもいいので翻訳してみてください。
大体の意味はわかります。
この場合、Java10.0.1を認識できないようです。
- itnkmkw
-
Scratcher
1000+ posts
Scratch2.0をModする会
分かりました。前にされた似たような質問を見つけたので、ver8に変えてみました。(その後、「jun50さんがver8くらいに」と答えてくれていたのを知った)mod始めようと思いまして、試してみたんですが、最初のビルド中に、「./gradlew build」を入れたらjavaは最新版じゃない方がいいです。って出ました。どうすればいいですか?Windows10で、javaは最新版です。Could not determine java version from '10.0.1'
機械翻訳でもいいので翻訳してみてください。
大体の意味はわかります。
この場合、Java10.0.1を認識できないようです。
・・・補足・・・
英文の意味は分かってますが、解決策と、問題の原因を知りたかったのです。
・・・追記・・・
ERROR: JAVA_HOME is not set and no 'java' command could be found in your PATH. Please set the JAVA_HOME variable in your environment to match the location of your Java installation.
Last edited by itnkmkw (July 10, 2018 08:45:00)
- jun50
-
Scratcher
1000+ posts
Scratch2.0をModする会
問題はJDKではないく、環境変数です。JDKはインストールしてありますか分かりました。ver8に変えてみました。mod始めようと思いまして、試してみたんですが、最初のビルド中に、「./gradlew build」を入れたらjavaは最新版じゃない方がいいです。って出ました。どうすればいいですか?Windows10で、javaは最新版です。Could not determine java version from '10.0.1'
機械翻訳でもいいので翻訳してみてください。
大体の意味はわかります。
この場合、Java10.0.1を認識できないようです。
・・・追記・・・またもやエラーです。どうしましょうERROR: JAVA_HOME is not set and no 'java' command could be found in your PATH. Please set the JAVA_HOME variable in your environment to match the location of your Java installation.
JAVA?_HOMEという環境変数が必要ですが、それがないことを示しています。
JAVA_HOMEです。
お詫びして訂正します。
Last edited by jun50 (July 10, 2018 08:12:04)
- itnkmkw
-
Scratcher
1000+ posts
Scratch2.0をModする会
JDKは入っています。ver8に変えたというのは、JDKのことです。JDKはインストールしてありますか問題はJDKではないく、環境変数です。
JAVA_HOMEという環境変数が必要ですが、それがないことを示しています。ありがとうございます。それで、解決策としては、何をすれば?
Last edited by itnkmkw (July 10, 2018 08:41:31)
- jun50
-
Scratcher
1000+ posts
Scratch2.0をModする会
すみませんが、30分ほどお待ちください。JDKは入っています。ver8に変えたというのは、JDKのことです。JDKはインストールしてありますか問題はJDKではないく、環境変数です。JAVA_HOMEという環境変数が必要ですが、それがないことを示しています。ありがとうございます。それで、解決策としては、何をすれば?
家じゃないので…
- itnkmkw
-
Scratcher
1000+ posts
Scratch2.0をModする会
すみませんが、30分ほどお待ちください。ほーい。ありがとうございまーす。。。
家じゃないので…
Last edited by itnkmkw (July 10, 2018 08:47:20)
- apple502j
-
Scratcher
1000+ posts
Scratch2.0をModする会
なんかModしてみたらシンタックスエラーが出ました どういうことでしょうか構文エラーです。プログラムの書き間違い。
- jun50
-
Scratcher
1000+ posts
Scratch2.0をModする会
JDKはどこにインストールしましたか?すみませんが、30分ほどお待ちください。ほーい。ありがとうございまーす。。。
家じゃないので…
- itnkmkw
-
Scratcher
1000+ posts
Scratch2.0をModする会
ちょっと見当たりません…インストールできてなかったのかな?ver8のダウンロード先URLを教えてくれませんか?JDKはどこにインストールしましたか?すみませんが、30分ほどお待ちください。ほーい。ありがとうございまーす。。。
家じゃないので…
僕がインストールしたものはたぶんあってると思うのですが、もう一度インストーラーを起動させて、インストールしてみたんですが、やっぱ見当たりません…失敗したのか、もしやそもそもダウンロードするものを間違ってるのかな?
Last edited by itnkmkw (July 12, 2018 06:12:16)