Discuss Scratch

mii-10
Scratcher
100+ posts

Scratch2.0をModする会

Windows1000000 wrote:

jun50 wrote:

Windows1000000 wrote:

mii-10 wrote:

省略
すみません。Interpreter.asとspecs.asはどこのフォルダーにあるのですか?
確かsrcだったと思います。
それが見当たらないんです。
既存のブロックの
when this sprite clicked
などで検索してみては?
apple502j
Scratcher
1000+ posts

Scratch2.0をModする会

scratch-flashをgitで落としたなら、そのフォルダの真下にsrcがあり、
そこにSpecs.as
そのフォルダのinterpreterフォルダ内に
Interpreter.asがあります
apple502j
Scratcher
1000+ posts

Scratch2.0をModする会

Windows1000000 wrote:

apple502j wrote:

scratch-flashをgitで落としたなら、そのフォルダの真下にsrcがあり、
そこにSpecs.as
そのフォルダのinterpreterフォルダ内に
Interpreter.asがあります
どのようなGitコマンドを実行すれば良いですか?
scratch-flashはもうありますか?
そのフォルダ内にはCOPYINGとかsrcとかTRADEMARKとかREADME.mdとかがあるはずです
inoking
Scratcher
1000+ posts

Scratch2.0をModする会

Windows1000000 wrote:

apple502j wrote:

scratch-flashをgitで落としたなら、そのフォルダの真下にsrcがあり、
そこにSpecs.as
そのフォルダのinterpreterフォルダ内に
Interpreter.asがあります
どのようなGitコマンドを実行すれば良いですか?
#1 の内容でできませんか?
mii-10
Scratcher
100+ posts

Scratch2.0をModする会

Windows1000000 wrote:

scratchをGradleでコンパイルしようとしたんですが、以下のエラーが出ました。
FAILURE: Build failed with an exception.

* What went wrong:
Could not determine java version from '10.0.1'.

* Try:
Run with --stacktrace option to get the stack trace. Run with --info or --debug option to get more log output.
この対処方法はありますか?
javaのバージョン10.0.1が、コンパイラで認識できないことがが原因ですのでjavaのバージョンを下げてみてください。
自分は1.8.0_171です。
inoking
Scratcher
1000+ posts

Scratch2.0をModする会

Windows1000000 wrote:

scratchをGradleでコンパイルしようとしたんですが、以下のエラーが出ました。
FAILURE: Build failed with an exception.

* What went wrong:
Could not determine java version from '10.0.1'.

* Try:
Run with --stacktrace option to get the stack trace. Run with --info or --debug option to get more log output.
この対処方法はありますか?
#186 で同様の質問と、それを解消するためのアプローチが出ていますが試しましたか?
apple502j
Scratcher
1000+ posts

Scratch2.0をModする会

Windows1000000 wrote:

Java SE 8を入れることでなんとかコンパイラ認識できるところまできたんですが今度はこんなエラーが出ました
FAILURE: Build failed with an exception.

* What went wrong:
Task 'bulid' not found in root project 'scratch-flash'. Some candidates are: 'build'.

* Try:
Run gradlew tasks to get a list of available tasks. Run with --stacktrace option to get the stack trace. Run with --info or --debug option to get more log output.

BUILD FAILED
この対処方法はあるでしょうか
スペルミスです。
buildです。(ビー・ユー・アイ・エル・ディー、小文字にしてね。)
itnkmkw
Scratcher
1000+ posts

Scratch2.0をModする会

mod始めようと思いまして、試してみたんですが、最初のビルド中に、「./gradlew build」を入れたら
 Could not determine java version from '10.0.1'
って出ました。どうすればいいですか?Windows10で、javaは最新版です。
jun50
Scratcher
1000+ posts

Scratch2.0をModする会

itnkmkw wrote:

mod始めようと思いまして、試してみたんですが、最初のビルド中に、「./gradlew build」を入れたら
 Could not determine java version from '10.0.1'
って出ました。どうすればいいですか?Windows10で、javaは最新版です。
javaは最新版じゃない方がいいです。
機械翻訳でもいいので翻訳してみてください。
大体の意味はわかります。

この場合、Java10.0.1を認識できないようです。
jun50
Scratcher
1000+ posts

Scratch2.0をModする会

java8くらいに下げてみてください。
itnkmkw
Scratcher
1000+ posts

Scratch2.0をModする会

jun50 wrote:

itnkmkw wrote:

mod始めようと思いまして、試してみたんですが、最初のビルド中に、「./gradlew build」を入れたら
 Could not determine java version from '10.0.1'
って出ました。どうすればいいですか?Windows10で、javaは最新版です。
javaは最新版じゃない方がいいです。
機械翻訳でもいいので翻訳してみてください。
大体の意味はわかります。

この場合、Java10.0.1を認識できないようです。
分かりました。前にされた似たような質問を見つけたので、ver8に変えてみました。(その後、「jun50さんがver8くらいに」と答えてくれていたのを知った)
・・・補足・・・
英文の意味は分かってますが、解決策と、問題の原因を知りたかったのです。


・・・追記・・・
 ERROR: JAVA_HOME is not set and no 'java' command could be found in your PATH.
Please set the JAVA_HOME variable in your environment to match the
location of your Java installation.
またもやエラーです。どうしましょう

Last edited by itnkmkw (July 10, 2018 08:45:00)

jun50
Scratcher
1000+ posts

Scratch2.0をModする会

Windows1000000 wrote:

itnkmkw wrote:

jun50 wrote:

itnkmkw wrote:

mod始めようと思いまして、試してみたんですが、最初のビルド中に、「./gradlew build」を入れたら
 Could not determine java version from '10.0.1'
って出ました。どうすればいいですか?Windows10で、javaは最新版です。
javaは最新版じゃない方がいいです。
機械翻訳でもいいので翻訳してみてください。
大体の意味はわかります。

この場合、Java10.0.1を認識できないようです。
分かりました。ver8に変えてみました。

・・・追記・・・
 ERROR: JAVA_HOME is not set and no 'java' command could be found in your PATH.
Please set the JAVA_HOME variable in your environment to match the
location of your Java installation.
またもやエラーです。どうしましょう
JDKはインストールしてありますか
問題はJDKではないく、環境変数です。
JAVA?_HOMEという環境変数が必要ですが、それがないことを示しています。
JAVA_HOMEです。
お詫びして訂正します。

Last edited by jun50 (July 10, 2018 08:12:04)

itnkmkw
Scratcher
1000+ posts

Scratch2.0をModする会

jun50 wrote:

Windows1000000 wrote:

JDKはインストールしてありますか
問題はJDKではないく、環境変数です。
JDKは入っています。ver8に変えたというのは、JDKのことです。

jun50 wrote:

JAVA_HOMEという環境変数が必要ですが、それがないことを示しています。
ありがとうございます。それで、解決策としては、何をすれば?

Last edited by itnkmkw (July 10, 2018 08:41:31)

jun50
Scratcher
1000+ posts

Scratch2.0をModする会

itnkmkw wrote:

jun50 wrote:

Windows1000000 wrote:

JDKはインストールしてありますか
問題はJDKではないく、環境変数です。
JDKは入っています。ver8に変えたというのは、JDKのことです。

jun50 wrote:

JAVA_HOMEという環境変数が必要ですが、それがないことを示しています。
ありがとうございます。それで、解決策としては、何をすれば?
すみませんが、30分ほどお待ちください。
家じゃないので…
itnkmkw
Scratcher
1000+ posts

Scratch2.0をModする会

jun50 wrote:

すみませんが、30分ほどお待ちください。
家じゃないので…
ほーい。ありがとうございまーす。。。

Last edited by itnkmkw (July 10, 2018 08:47:20)

jun50
Scratcher
1000+ posts

Scratch2.0をModする会

JDKのインストール先のPATHを教えてください。
apple502j
Scratcher
1000+ posts

Scratch2.0をModする会

Windows1000000 wrote:

なんかModしてみたらシンタックスエラーが出ました どういうことでしょうか
構文エラーです。プログラムの書き間違い。
inoking
Scratcher
1000+ posts

Scratch2.0をModする会

まずはソースコードを変えずにそのままビルドしていますよね?
エラーは具体的に知らせてください。
jun50
Scratcher
1000+ posts

Scratch2.0をModする会

itnkmkw wrote:

jun50 wrote:

すみませんが、30分ほどお待ちください。
家じゃないので…
ほーい。ありがとうございまーす。。。
JDKはどこにインストールしましたか?
itnkmkw
Scratcher
1000+ posts

Scratch2.0をModする会

jun50 wrote:

itnkmkw wrote:

jun50 wrote:

すみませんが、30分ほどお待ちください。
家じゃないので…
ほーい。ありがとうございまーす。。。
JDKはどこにインストールしましたか?
ちょっと見当たりません…インストールできてなかったのかな?ver8のダウンロード先URLを教えてくれませんか?

僕がインストールしたものはたぶんあってると思うのですが、もう一度インストーラーを起動させて、インストールしてみたんですが、やっぱ見当たりません…失敗したのか、もしやそもそもダウンロードするものを間違ってるのかな?

Last edited by itnkmkw (July 12, 2018 06:12:16)

Powered by DjangoBB