Discuss Scratch

jun50
Scratcher
1000+ posts

Scratch2.0をModする会

java8くらいに下げてみてください。

ぎちょおおおおおおおおおおおおおおおおおおおおおおおおおおおおおおおおおおおおおおおおおおおおおおおおおおおおおおおおお
ディスカッションフォーラムでの議論において、コミュニティガイドラインに違反せず、
建設的な議論になることを望みまああああああああああああああああああああああああああああああああああああああああああす
(議長が誰とは言っていない)
itnkmkw
Scratcher
1000+ posts

Scratch2.0をModする会

jun50 wrote:

itnkmkw wrote:

mod始めようと思いまして、試してみたんですが、最初のビルド中に、「./gradlew build」を入れたら
 Could not determine java version from '10.0.1'
って出ました。どうすればいいですか?Windows10で、javaは最新版です。
javaは最新版じゃない方がいいです。
機械翻訳でもいいので翻訳してみてください。
大体の意味はわかります。

この場合、Java10.0.1を認識できないようです。
分かりました。前にされた似たような質問を見つけたので、ver8に変えてみました。(その後、「jun50さんがver8くらいに」と答えてくれていたのを知った)
・・・補足・・・
英文の意味は分かってますが、解決策と、問題の原因を知りたかったのです。


・・・追記・・・
 ERROR: JAVA_HOME is not set and no 'java' command could be found in your PATH.
Please set the JAVA_HOME variable in your environment to match the
location of your Java installation.
またもやエラーです。どうしましょう

Last edited by itnkmkw (July 10, 2018 08:45:00)


皆さ~ん!「聖書」と言う言葉を聞いてどう思いますか?興味のある方はここココここへ!
病んでない人はいない。心を学べば学ぶほど、それが極論でも何でもなく真実であることに気が付く。
そろそろ自分の心と本気で向き合ってみませんか?興味のある方はこちら。

@itnkmkwと申します。沖縄在住(ホームスクーラー)です。心理学音楽やってます。MIX依頼募集中!

《コミュニティーをより良い所にするために》Scratch に関係ないトピックについての意見交換所では議事進行役を務めております(名ばかりですが)。どーぞよろしく
最近プロジェクト作ってませんが、もうすぐ聖書RPGの製作を再開しますので…いまは彩雲が忙しいのだ。

Windows1000000
Scratcher
500+ posts

Scratch2.0をModする会

itnkmkw wrote:

jun50 wrote:

itnkmkw wrote:

mod始めようと思いまして、試してみたんですが、最初のビルド中に、「./gradlew build」を入れたら
 Could not determine java version from '10.0.1'
って出ました。どうすればいいですか?Windows10で、javaは最新版です。
javaは最新版じゃない方がいいです。
機械翻訳でもいいので翻訳してみてください。
大体の意味はわかります。

この場合、Java10.0.1を認識できないようです。
分かりました。ver8に変えてみました。

・・・追記・・・
 ERROR: JAVA_HOME is not set and no 'java' command could be found in your PATH.
Please set the JAVA_HOME variable in your environment to match the
location of your Java installation.
またもやエラーです。どうしましょう
JDKはインストールしてありますか

Last edited by Windows1000000 (July 10, 2018 07:53:29)


こんにちは!Windows1000000です!
jun50
Scratcher
1000+ posts

Scratch2.0をModする会

Windows1000000 wrote:

itnkmkw wrote:

jun50 wrote:

itnkmkw wrote:

mod始めようと思いまして、試してみたんですが、最初のビルド中に、「./gradlew build」を入れたら
 Could not determine java version from '10.0.1'
って出ました。どうすればいいですか?Windows10で、javaは最新版です。
javaは最新版じゃない方がいいです。
機械翻訳でもいいので翻訳してみてください。
大体の意味はわかります。

この場合、Java10.0.1を認識できないようです。
分かりました。ver8に変えてみました。

・・・追記・・・
 ERROR: JAVA_HOME is not set and no 'java' command could be found in your PATH.
Please set the JAVA_HOME variable in your environment to match the
location of your Java installation.
またもやエラーです。どうしましょう
JDKはインストールしてありますか
問題はJDKではないく、環境変数です。
JAVA?_HOMEという環境変数が必要ですが、それがないことを示しています。
JAVA_HOMEです。
お詫びして訂正します。

Last edited by jun50 (July 10, 2018 08:12:04)


ぎちょおおおおおおおおおおおおおおおおおおおおおおおおおおおおおおおおおおおおおおおおおおおおおおおおおおおおおおおおお
ディスカッションフォーラムでの議論において、コミュニティガイドラインに違反せず、
建設的な議論になることを望みまああああああああああああああああああああああああああああああああああああああああああす
(議長が誰とは言っていない)
itnkmkw
Scratcher
1000+ posts

Scratch2.0をModする会

jun50 wrote:

Windows1000000 wrote:

JDKはインストールしてありますか
問題はJDKではないく、環境変数です。
JDKは入っています。ver8に変えたというのは、JDKのことです。

jun50 wrote:

JAVA_HOMEという環境変数が必要ですが、それがないことを示しています。
ありがとうございます。それで、解決策としては、何をすれば?

Last edited by itnkmkw (July 10, 2018 08:41:31)


皆さ~ん!「聖書」と言う言葉を聞いてどう思いますか?興味のある方はここココここへ!
病んでない人はいない。心を学べば学ぶほど、それが極論でも何でもなく真実であることに気が付く。
そろそろ自分の心と本気で向き合ってみませんか?興味のある方はこちら。

@itnkmkwと申します。沖縄在住(ホームスクーラー)です。心理学音楽やってます。MIX依頼募集中!

《コミュニティーをより良い所にするために》Scratch に関係ないトピックについての意見交換所では議事進行役を務めております(名ばかりですが)。どーぞよろしく
最近プロジェクト作ってませんが、もうすぐ聖書RPGの製作を再開しますので…いまは彩雲が忙しいのだ。

jun50
Scratcher
1000+ posts

Scratch2.0をModする会

itnkmkw wrote:

jun50 wrote:

Windows1000000 wrote:

JDKはインストールしてありますか
問題はJDKではないく、環境変数です。
JDKは入っています。ver8に変えたというのは、JDKのことです。

jun50 wrote:

JAVA_HOMEという環境変数が必要ですが、それがないことを示しています。
ありがとうございます。それで、解決策としては、何をすれば?
すみませんが、30分ほどお待ちください。
家じゃないので…

ぎちょおおおおおおおおおおおおおおおおおおおおおおおおおおおおおおおおおおおおおおおおおおおおおおおおおおおおおおおおお
ディスカッションフォーラムでの議論において、コミュニティガイドラインに違反せず、
建設的な議論になることを望みまああああああああああああああああああああああああああああああああああああああああああす
(議長が誰とは言っていない)
itnkmkw
Scratcher
1000+ posts

Scratch2.0をModする会

jun50 wrote:

すみませんが、30分ほどお待ちください。
家じゃないので…
ほーい。ありがとうございまーす。。。

Last edited by itnkmkw (July 10, 2018 08:47:20)


皆さ~ん!「聖書」と言う言葉を聞いてどう思いますか?興味のある方はここココここへ!
病んでない人はいない。心を学べば学ぶほど、それが極論でも何でもなく真実であることに気が付く。
そろそろ自分の心と本気で向き合ってみませんか?興味のある方はこちら。

@itnkmkwと申します。沖縄在住(ホームスクーラー)です。心理学音楽やってます。MIX依頼募集中!

《コミュニティーをより良い所にするために》Scratch に関係ないトピックについての意見交換所では議事進行役を務めております(名ばかりですが)。どーぞよろしく
最近プロジェクト作ってませんが、もうすぐ聖書RPGの製作を再開しますので…いまは彩雲が忙しいのだ。

jun50
Scratcher
1000+ posts

Scratch2.0をModする会

JDKのインストール先のPATHを教えてください。

ぎちょおおおおおおおおおおおおおおおおおおおおおおおおおおおおおおおおおおおおおおおおおおおおおおおおおおおおおおおおお
ディスカッションフォーラムでの議論において、コミュニティガイドラインに違反せず、
建設的な議論になることを望みまああああああああああああああああああああああああああああああああああああああああああす
(議長が誰とは言っていない)
Windows1000000
Scratcher
500+ posts

Scratch2.0をModする会

なんかModしてみたらシンタックスエラーが出ました どういうことでしょうか

こんにちは!Windows1000000です!
apple502j
Scratcher
1000+ posts

Scratch2.0をModする会

Windows1000000 wrote:

なんかModしてみたらシンタックスエラーが出ました どういうことでしょうか
構文エラーです。プログラムの書き間違い。

OSS Contributor & Translator of Scratch 3.0, Experienced Wikian @ enwiki, Admin @ jawiki
51 Pull Requests merged to LLK repository since April 4, 2018
Speaks English & Japanese

Scratch 3.0のOSS貢献者と翻訳者、英語版ウィキでExperienced Wikian、日本語版管理者
2018年4月4日から、51本のPRがいままでにLLKリポジトリにマージされました
日本語+英語
Windows1000000
Scratcher
500+ posts

Scratch2.0をModする会

apple502j wrote:

Windows1000000 wrote:

なんかModしてみたらシンタックスエラーが出ました どういうことでしょうか
構文エラーです。プログラムの書き間違い。
なんか色々な.asファイルにエラーだとGradleが言ってきます

Last edited by Windows1000000 (July 10, 2018 10:23:32)


こんにちは!Windows1000000です!
inoking
Scratcher
1000+ posts

Scratch2.0をModする会

まずはソースコードを変えずにそのままビルドしていますよね?
エラーは具体的に知らせてください。

当初はアカウントを親子で共用していましたが、アカウント分離しました。アナウンス内容
父:inoking   子:inotomoking
Windows1000000
Scratcher
500+ posts

Scratch2.0をModする会

削除

Last edited by Windows1000000 (July 12, 2018 08:28:52)


こんにちは!Windows1000000です!
jun50
Scratcher
1000+ posts

Scratch2.0をModする会

itnkmkw wrote:

jun50 wrote:

すみませんが、30分ほどお待ちください。
家じゃないので…
ほーい。ありがとうございまーす。。。
JDKはどこにインストールしましたか?

ぎちょおおおおおおおおおおおおおおおおおおおおおおおおおおおおおおおおおおおおおおおおおおおおおおおおおおおおおおおおお
ディスカッションフォーラムでの議論において、コミュニティガイドラインに違反せず、
建設的な議論になることを望みまああああああああああああああああああああああああああああああああああああああああああす
(議長が誰とは言っていない)
itnkmkw
Scratcher
1000+ posts

Scratch2.0をModする会

jun50 wrote:

itnkmkw wrote:

jun50 wrote:

すみませんが、30分ほどお待ちください。
家じゃないので…
ほーい。ありがとうございまーす。。。
JDKはどこにインストールしましたか?
ちょっと見当たりません…インストールできてなかったのかな?ver8のダウンロード先URLを教えてくれませんか?

僕がインストールしたものはたぶんあってると思うのですが、もう一度インストーラーを起動させて、インストールしてみたんですが、やっぱ見当たりません…失敗したのか、もしやそもそもダウンロードするものを間違ってるのかな?

Last edited by itnkmkw (July 12, 2018 06:12:16)


皆さ~ん!「聖書」と言う言葉を聞いてどう思いますか?興味のある方はここココここへ!
病んでない人はいない。心を学べば学ぶほど、それが極論でも何でもなく真実であることに気が付く。
そろそろ自分の心と本気で向き合ってみませんか?興味のある方はこちら。

@itnkmkwと申します。沖縄在住(ホームスクーラー)です。心理学音楽やってます。MIX依頼募集中!

《コミュニティーをより良い所にするために》Scratch に関係ないトピックについての意見交換所では議事進行役を務めております(名ばかりですが)。どーぞよろしく
最近プロジェクト作ってませんが、もうすぐ聖書RPGの製作を再開しますので…いまは彩雲が忙しいのだ。

apple502j
Scratcher
1000+ posts

Scratch2.0をModする会

Windows1000000 wrote:

 FAILURE: Build failed with an exception.

* What went wrong:
Execution failed for task ':compileFlex'.
> java.lang.Exception: mxmlc execution failed: /Users/Users/scratch-flash/src/uiwidgets/VariableTextField.as(26): col: 14 警告: コンストラクタ関数がクラス VariableTextField に指定されていません。

public class VariableTextField extends TextField {
^

/Users/Users/scratch-flash/src/com/adobe/utils/macro/AGALVar.as(10): col: 15 警告: コンストラクタ関数がクラス AGALVar に指定されていません。

public class AGALVar
^

/Users/Users/scratch-flash/src/Specs.as(400): col: 79 エラー: シンタックスエラー : identifier が comma の前に必要です。

["if %n then %s else %s", "r", 8, "ifThenString", "",""],
^

/Users/Users/scratch-flash/src/com/adobe/utils/macro/VM.as(5): col: 15 警告: コンストラクタ関数がクラス VM に指定されていません。

public class VM
^

/Users/Users/scratch-flash/src/com/adobe/utils/AGALMacroAssembler.as(725): col: 16 警告: コンストラクタ関数がクラス Macro に指定されていません。

internal class Macro
^

/Users/Users/scratch-flash/src/util/GIFDecoder.as(37): col: 14 警告: コンストラクタ関数がクラス GIFDecoder に指定されていません。

public class GIFDecoder {
^

/Users/Users/scratch-flash/src/util/JSON.as(33): col: 14 警告: コンストラクタ関数がクラス JSON に指定されていません。

public class JSON {
^

/Users/Users/scratch-flash/src/svgutils/SVGDisplayRender.as(39): col: 14 警告: コンストラクタ関数がクラス SVGDisplayRender に指定されていません。

public class SVGDisplayRender {
^

/Users/Users/scratch-flash/src/com/adobe/utils/macro/ExpressionParser.as(159): col: 7 警告: コンストラクタ関数がクラス OpInfo に指定されていません。

class OpInfo
^

/Users/Users/scratch-flash/src/com/adobe/utils/macro/BinaryExpression.as(3): col: 17 警告: コンストラクタ関数がクラス BinaryExpression に指定されていません。

internal class BinaryExpression extends com.adobe.utils.macro.Expression
^

/Users/Users/scratch-flash/src/uiwidgets/ScrollFrameContents.as(34): col: 14 警告: コンストラクタ関数がクラス ScrollFrameContents に指定されていません。

public class ScrollFrameContents extends Sprite {
^

/Users/Users/scratch-flash/src/svgutils/SVGImportPath.as(33): col: 14 警告: コンストラクタ関数がクラス SVGImportPath に指定されていません。

public class SVGImportPath {
^

/Users/Users/scratch-flash/src/util/ZipIO.as(24): col: 14 警告: コンストラクタ関数がクラス ZipIO に指定されていません。

public class ZipIO {
^

/Users/Users/scratch-flash/src/util/ZipIO.as(316): col: 7 警告: コンストラクタ関数がクラス Entry に指定されていません。

class Entry {
^

/Users/Users/scratch-flash/src/svgeditor/DrawProperties.as(21): col: 14 警告: コンストラクタ関数がクラス DrawProperties に指定されていません。

public class DrawProperties {
^



* Try:
Run with --stacktrace option to get the stack trace. Run with --info or --debug option to get more log output.

BUILD FAILED
(一部apple502jさんのModdingコードを参考にしているため、一部apple502jさんが書いたコードもあると思います)
私の3項演算ブロックがおかしいようですね。ただこれだけでは何も悪くなさそうです。
コードすべてをGitHubに挙げてくれませんか?
(これはバグ解明のためでもありますが、私のコードは基本GPLのため、著作権を行使しようと思えばできます。)

OSS Contributor & Translator of Scratch 3.0, Experienced Wikian @ enwiki, Admin @ jawiki
51 Pull Requests merged to LLK repository since April 4, 2018
Speaks English & Japanese

Scratch 3.0のOSS貢献者と翻訳者、英語版ウィキでExperienced Wikian、日本語版管理者
2018年4月4日から、51本のPRがいままでにLLKリポジトリにマージされました
日本語+英語
Windows1000000
Scratcher
500+ posts

Scratch2.0をModする会

apple502j wrote:

Windows1000000 wrote:

 FAILURE: Build failed with an exception.

* What went wrong:
Execution failed for task ':compileFlex'.
> java.lang.Exception: mxmlc execution failed: /Users/Users/scratch-flash/src/uiwidgets/VariableTextField.as(26): col: 14 警告: コンストラクタ関数がクラス VariableTextField に指定されていません。

public class VariableTextField extends TextField {
^

/Users/Users/scratch-flash/src/com/adobe/utils/macro/AGALVar.as(10): col: 15 警告: コンストラクタ関数がクラス AGALVar に指定されていません。

public class AGALVar
^

/Users/Users/scratch-flash/src/Specs.as(400): col: 79 エラー: シンタックスエラー : identifier が comma の前に必要です。

["if %n then %s else %s", "r", 8, "ifThenString", "",""],
^

/Users/Users/scratch-flash/src/com/adobe/utils/macro/VM.as(5): col: 15 警告: コンストラクタ関数がクラス VM に指定されていません。

public class VM
^

/Users/Users/scratch-flash/src/com/adobe/utils/AGALMacroAssembler.as(725): col: 16 警告: コンストラクタ関数がクラス Macro に指定されていません。

internal class Macro
^

/Users/Users/scratch-flash/src/util/GIFDecoder.as(37): col: 14 警告: コンストラクタ関数がクラス GIFDecoder に指定されていません。

public class GIFDecoder {
^

/Users/Users/scratch-flash/src/util/JSON.as(33): col: 14 警告: コンストラクタ関数がクラス JSON に指定されていません。

public class JSON {
^

/Users/Users/scratch-flash/src/svgutils/SVGDisplayRender.as(39): col: 14 警告: コンストラクタ関数がクラス SVGDisplayRender に指定されていません。

public class SVGDisplayRender {
^

/Users/Users/scratch-flash/src/com/adobe/utils/macro/ExpressionParser.as(159): col: 7 警告: コンストラクタ関数がクラス OpInfo に指定されていません。

class OpInfo
^

/Users/Users/scratch-flash/src/com/adobe/utils/macro/BinaryExpression.as(3): col: 17 警告: コンストラクタ関数がクラス BinaryExpression に指定されていません。

internal class BinaryExpression extends com.adobe.utils.macro.Expression
^

/Users/Users/scratch-flash/src/uiwidgets/ScrollFrameContents.as(34): col: 14 警告: コンストラクタ関数がクラス ScrollFrameContents に指定されていません。

public class ScrollFrameContents extends Sprite {
^

/Users/Users/scratch-flash/src/svgutils/SVGImportPath.as(33): col: 14 警告: コンストラクタ関数がクラス SVGImportPath に指定されていません。

public class SVGImportPath {
^

/Users/Users/scratch-flash/src/util/ZipIO.as(24): col: 14 警告: コンストラクタ関数がクラス ZipIO に指定されていません。

public class ZipIO {
^

/Users/Users/scratch-flash/src/util/ZipIO.as(316): col: 7 警告: コンストラクタ関数がクラス Entry に指定されていません。

class Entry {
^

/Users/Users/scratch-flash/src/svgeditor/DrawProperties.as(21): col: 14 警告: コンストラクタ関数がクラス DrawProperties に指定されていません。

public class DrawProperties {
^



* Try:
Run with --stacktrace option to get the stack trace. Run with --info or --debug option to get more log output.

BUILD FAILED
(一部apple502jさんのModdingコードを参考にしているため、一部apple502jさんが書いたコードもあると思います)
私の3項演算ブロックがおかしいようですね。ただこれだけでは何も悪くなさそうです。
コードすべてをGitHubに挙げてくれませんか?
(これはバグ解明のためでもありますが、私のコードは基本GPLのため、著作権を行使しようと思えばできます。)
GitHubアカウント持っていないんです…

こんにちは!Windows1000000です!
abee
Scratcher
1000+ posts

Scratch2.0をModする会

inokingさんが書かれている通り、まずはソースをどこも変えずにビルドできるかどうかを確認しないと、問題解決が困難になります。
Windows1000000
Scratcher
500+ posts

Scratch2.0をModする会

abee wrote:

inokingさんが書かれている通り、まずはソースをどこも変えずにビルドできるかどうかを確認しないと、問題解決が困難になります。
じゃあ諦めます

こんにちは!Windows1000000です!
inoking
Scratcher
1000+ posts

Scratch2.0をModする会

Windows1000000 wrote:

じゃあ諦めます
ではなくて一歩一歩進んでいかないと解決しませんよ。
ということです。

いつも言葉遣いに気をつけられているようですが
解決に向けて協力しようとしていた人にとっては、これは投げやりに聞こえますよ。

当初はアカウントを親子で共用していましたが、アカウント分離しました。アナウンス内容
父:inoking   子:inotomoking

Powered by DjangoBB

Standard | Mobile