jun50

java8くらいに下げてみてください。

itnkmkw

jun50 wrote:

itnkmkw wrote:

mod始めようと思いまして、試してみたんですが、最初のビルド中に、「./gradlew build」を入れたら
 Could not determine java version from '10.0.1'
って出ました。どうすればいいですか?Windows10で、javaは最新版です。
javaは最新版じゃない方がいいです。
機械翻訳でもいいので翻訳してみてください。
大体の意味はわかります。

この場合、Java10.0.1を認識できないようです。
分かりました。前にされた似たような質問を見つけたので、ver8に変えてみました。(その後、「jun50さんがver8くらいに」と答えてくれていたのを知った)
・・・補足・・・
英文の意味は分かってますが、解決策と、問題の原因を知りたかったのです。


・・・追記・・・
 ERROR: JAVA_HOME is not set and no 'java' command could be found in your PATH.
Please set the JAVA_HOME variable in your environment to match the
location of your Java installation.
またもやエラーです。どうしましょう

Windows1000000

itnkmkw wrote:

jun50 wrote:

itnkmkw wrote:

mod始めようと思いまして、試してみたんですが、最初のビルド中に、「./gradlew build」を入れたら
 Could not determine java version from '10.0.1'
って出ました。どうすればいいですか?Windows10で、javaは最新版です。
javaは最新版じゃない方がいいです。
機械翻訳でもいいので翻訳してみてください。
大体の意味はわかります。

この場合、Java10.0.1を認識できないようです。
分かりました。ver8に変えてみました。

・・・追記・・・
 ERROR: JAVA_HOME is not set and no 'java' command could be found in your PATH.
Please set the JAVA_HOME variable in your environment to match the
location of your Java installation.
またもやエラーです。どうしましょう
JDKはインストールしてありますか

jun50

Windows1000000 wrote:

itnkmkw wrote:

jun50 wrote:

itnkmkw wrote:

mod始めようと思いまして、試してみたんですが、最初のビルド中に、「./gradlew build」を入れたら
 Could not determine java version from '10.0.1'
って出ました。どうすればいいですか?Windows10で、javaは最新版です。
javaは最新版じゃない方がいいです。
機械翻訳でもいいので翻訳してみてください。
大体の意味はわかります。

この場合、Java10.0.1を認識できないようです。
分かりました。ver8に変えてみました。

・・・追記・・・
 ERROR: JAVA_HOME is not set and no 'java' command could be found in your PATH.
Please set the JAVA_HOME variable in your environment to match the
location of your Java installation.
またもやエラーです。どうしましょう
JDKはインストールしてありますか
問題はJDKではないく、環境変数です。
JAVA?_HOMEという環境変数が必要ですが、それがないことを示しています。
JAVA_HOMEです。
お詫びして訂正します。

itnkmkw

jun50 wrote:

Windows1000000 wrote:

JDKはインストールしてありますか
問題はJDKではないく、環境変数です。
JDKは入っています。ver8に変えたというのは、JDKのことです。

jun50 wrote:

JAVA_HOMEという環境変数が必要ですが、それがないことを示しています。
ありがとうございます。それで、解決策としては、何をすれば?

jun50

itnkmkw wrote:

jun50 wrote:

Windows1000000 wrote:

JDKはインストールしてありますか
問題はJDKではないく、環境変数です。
JDKは入っています。ver8に変えたというのは、JDKのことです。

jun50 wrote:

JAVA_HOMEという環境変数が必要ですが、それがないことを示しています。
ありがとうございます。それで、解決策としては、何をすれば?
すみませんが、30分ほどお待ちください。
家じゃないので…

itnkmkw

jun50 wrote:

すみませんが、30分ほどお待ちください。
家じゃないので…
ほーい。ありがとうございまーす。。。

jun50

JDKのインストール先のPATHを教えてください。

Windows1000000

なんかModしてみたらシンタックスエラーが出ました どういうことでしょうか

apple502j

Windows1000000 wrote:

なんかModしてみたらシンタックスエラーが出ました どういうことでしょうか
構文エラーです。プログラムの書き間違い。

Windows1000000

apple502j wrote:

Windows1000000 wrote:

なんかModしてみたらシンタックスエラーが出ました どういうことでしょうか
構文エラーです。プログラムの書き間違い。
なんか色々な.asファイルにエラーだとGradleが言ってきます

inoking

まずはソースコードを変えずにそのままビルドしていますよね?
エラーは具体的に知らせてください。

Windows1000000

削除

jun50

itnkmkw wrote:

jun50 wrote:

すみませんが、30分ほどお待ちください。
家じゃないので…
ほーい。ありがとうございまーす。。。
JDKはどこにインストールしましたか?

itnkmkw

jun50 wrote:

itnkmkw wrote:

jun50 wrote:

すみませんが、30分ほどお待ちください。
家じゃないので…
ほーい。ありがとうございまーす。。。
JDKはどこにインストールしましたか?
ちょっと見当たりません…インストールできてなかったのかな?ver8のダウンロード先URLを教えてくれませんか?

僕がインストールしたものはたぶんあってると思うのですが、もう一度インストーラーを起動させて、インストールしてみたんですが、やっぱ見当たりません…失敗したのか、もしやそもそもダウンロードするものを間違ってるのかな?

apple502j

Windows1000000 wrote:

 FAILURE: Build failed with an exception.

* What went wrong:
Execution failed for task ':compileFlex'.
> java.lang.Exception: mxmlc execution failed: /Users/Users/scratch-flash/src/uiwidgets/VariableTextField.as(26): col: 14 警告: コンストラクタ関数がクラス VariableTextField に指定されていません。

public class VariableTextField extends TextField {
^

/Users/Users/scratch-flash/src/com/adobe/utils/macro/AGALVar.as(10): col: 15 警告: コンストラクタ関数がクラス AGALVar に指定されていません。

public class AGALVar
^

/Users/Users/scratch-flash/src/Specs.as(400): col: 79 エラー: シンタックスエラー : identifier が comma の前に必要です。

["if %n then %s else %s", "r", 8, "ifThenString", "",""],
^

/Users/Users/scratch-flash/src/com/adobe/utils/macro/VM.as(5): col: 15 警告: コンストラクタ関数がクラス VM に指定されていません。

public class VM
^

/Users/Users/scratch-flash/src/com/adobe/utils/AGALMacroAssembler.as(725): col: 16 警告: コンストラクタ関数がクラス Macro に指定されていません。

internal class Macro
^

/Users/Users/scratch-flash/src/util/GIFDecoder.as(37): col: 14 警告: コンストラクタ関数がクラス GIFDecoder に指定されていません。

public class GIFDecoder {
^

/Users/Users/scratch-flash/src/util/JSON.as(33): col: 14 警告: コンストラクタ関数がクラス JSON に指定されていません。

public class JSON {
^

/Users/Users/scratch-flash/src/svgutils/SVGDisplayRender.as(39): col: 14 警告: コンストラクタ関数がクラス SVGDisplayRender に指定されていません。

public class SVGDisplayRender {
^

/Users/Users/scratch-flash/src/com/adobe/utils/macro/ExpressionParser.as(159): col: 7 警告: コンストラクタ関数がクラス OpInfo に指定されていません。

class OpInfo
^

/Users/Users/scratch-flash/src/com/adobe/utils/macro/BinaryExpression.as(3): col: 17 警告: コンストラクタ関数がクラス BinaryExpression に指定されていません。

internal class BinaryExpression extends com.adobe.utils.macro.Expression
^

/Users/Users/scratch-flash/src/uiwidgets/ScrollFrameContents.as(34): col: 14 警告: コンストラクタ関数がクラス ScrollFrameContents に指定されていません。

public class ScrollFrameContents extends Sprite {
^

/Users/Users/scratch-flash/src/svgutils/SVGImportPath.as(33): col: 14 警告: コンストラクタ関数がクラス SVGImportPath に指定されていません。

public class SVGImportPath {
^

/Users/Users/scratch-flash/src/util/ZipIO.as(24): col: 14 警告: コンストラクタ関数がクラス ZipIO に指定されていません。

public class ZipIO {
^

/Users/Users/scratch-flash/src/util/ZipIO.as(316): col: 7 警告: コンストラクタ関数がクラス Entry に指定されていません。

class Entry {
^

/Users/Users/scratch-flash/src/svgeditor/DrawProperties.as(21): col: 14 警告: コンストラクタ関数がクラス DrawProperties に指定されていません。

public class DrawProperties {
^



* Try:
Run with --stacktrace option to get the stack trace. Run with --info or --debug option to get more log output.

BUILD FAILED
(一部apple502jさんのModdingコードを参考にしているため、一部apple502jさんが書いたコードもあると思います)
私の3項演算ブロックがおかしいようですね。ただこれだけでは何も悪くなさそうです。
コードすべてをGitHubに挙げてくれませんか?
(これはバグ解明のためでもありますが、私のコードは基本GPLのため、著作権を行使しようと思えばできます。)

Windows1000000

apple502j wrote:

Windows1000000 wrote:

 FAILURE: Build failed with an exception.

* What went wrong:
Execution failed for task ':compileFlex'.
> java.lang.Exception: mxmlc execution failed: /Users/Users/scratch-flash/src/uiwidgets/VariableTextField.as(26): col: 14 警告: コンストラクタ関数がクラス VariableTextField に指定されていません。

public class VariableTextField extends TextField {
^

/Users/Users/scratch-flash/src/com/adobe/utils/macro/AGALVar.as(10): col: 15 警告: コンストラクタ関数がクラス AGALVar に指定されていません。

public class AGALVar
^

/Users/Users/scratch-flash/src/Specs.as(400): col: 79 エラー: シンタックスエラー : identifier が comma の前に必要です。

["if %n then %s else %s", "r", 8, "ifThenString", "",""],
^

/Users/Users/scratch-flash/src/com/adobe/utils/macro/VM.as(5): col: 15 警告: コンストラクタ関数がクラス VM に指定されていません。

public class VM
^

/Users/Users/scratch-flash/src/com/adobe/utils/AGALMacroAssembler.as(725): col: 16 警告: コンストラクタ関数がクラス Macro に指定されていません。

internal class Macro
^

/Users/Users/scratch-flash/src/util/GIFDecoder.as(37): col: 14 警告: コンストラクタ関数がクラス GIFDecoder に指定されていません。

public class GIFDecoder {
^

/Users/Users/scratch-flash/src/util/JSON.as(33): col: 14 警告: コンストラクタ関数がクラス JSON に指定されていません。

public class JSON {
^

/Users/Users/scratch-flash/src/svgutils/SVGDisplayRender.as(39): col: 14 警告: コンストラクタ関数がクラス SVGDisplayRender に指定されていません。

public class SVGDisplayRender {
^

/Users/Users/scratch-flash/src/com/adobe/utils/macro/ExpressionParser.as(159): col: 7 警告: コンストラクタ関数がクラス OpInfo に指定されていません。

class OpInfo
^

/Users/Users/scratch-flash/src/com/adobe/utils/macro/BinaryExpression.as(3): col: 17 警告: コンストラクタ関数がクラス BinaryExpression に指定されていません。

internal class BinaryExpression extends com.adobe.utils.macro.Expression
^

/Users/Users/scratch-flash/src/uiwidgets/ScrollFrameContents.as(34): col: 14 警告: コンストラクタ関数がクラス ScrollFrameContents に指定されていません。

public class ScrollFrameContents extends Sprite {
^

/Users/Users/scratch-flash/src/svgutils/SVGImportPath.as(33): col: 14 警告: コンストラクタ関数がクラス SVGImportPath に指定されていません。

public class SVGImportPath {
^

/Users/Users/scratch-flash/src/util/ZipIO.as(24): col: 14 警告: コンストラクタ関数がクラス ZipIO に指定されていません。

public class ZipIO {
^

/Users/Users/scratch-flash/src/util/ZipIO.as(316): col: 7 警告: コンストラクタ関数がクラス Entry に指定されていません。

class Entry {
^

/Users/Users/scratch-flash/src/svgeditor/DrawProperties.as(21): col: 14 警告: コンストラクタ関数がクラス DrawProperties に指定されていません。

public class DrawProperties {
^



* Try:
Run with --stacktrace option to get the stack trace. Run with --info or --debug option to get more log output.

BUILD FAILED
(一部apple502jさんのModdingコードを参考にしているため、一部apple502jさんが書いたコードもあると思います)
私の3項演算ブロックがおかしいようですね。ただこれだけでは何も悪くなさそうです。
コードすべてをGitHubに挙げてくれませんか?
(これはバグ解明のためでもありますが、私のコードは基本GPLのため、著作権を行使しようと思えばできます。)
GitHubアカウント持っていないんです…

abee

inokingさんが書かれている通り、まずはソースをどこも変えずにビルドできるかどうかを確認しないと、問題解決が困難になります。

Windows1000000

abee wrote:

inokingさんが書かれている通り、まずはソースをどこも変えずにビルドできるかどうかを確認しないと、問題解決が困難になります。
じゃあ諦めます

inoking

Windows1000000 wrote:

じゃあ諦めます
ではなくて一歩一歩進んでいかないと解決しませんよ。
ということです。

いつも言葉遣いに気をつけられているようですが
解決に向けて協力しようとしていた人にとっては、これは投げやりに聞こえますよ。